{"text_format":"1","workbook":"xlsx","n_sheets":2,"sheets":["InputSheet","Premium Breakdown"],"not_rendered":{"charts":0,"images":0,"macros":1,"external_links":0,"defined_names":1,"comments":0,"pivot_tables":0},"unopened":[],"bounds":{"document_bytes":16777216,"sheet_cells":100000,"rows_first":2000,"rows_last":500,"rows_between":2000,"halvings":0,"cell_chars":16384,"cell_head_chars":4096},"cells_cut":0,"cells_raw":0,"read":"whole","date_system":"1900"}

{"sheet":"InputSheet","index":0,"n_rows":4219,"n_cols":27,"rows_kept":4219,"cut":false,"hidden":false,"merged":[[27,1,32,4],[2,11,2,12],[2,21,2,22],[17,1,17,2],[1,1,1,4],[6,1,11,1],[15,1,15,4],[24,3,24,4],[25,3,25,4]]}
[]
[null,"Health Reform Subsidy Calculator"]
[null,null,null,null,null,null,null,null,null,null,null,"Poverty Levels",null,null,null,null,null,null,null,null,null,"Drop Down lists"]
[null,"Yearly Income","Number of Adults (21+)","Number of Children (20 or Under)","Is Employer Coverage Available?",null,null,null,null,null,null,"Single Poverty Level",11651,null,null,"left 4","Poverty Level","Paid","OOP Max Single","Family",null,"Low",1,0,0,"Yes",21]
[null,null,null,null,null,null,null,null,null,"Premium Before Region",null,"Poverty Level for add. Person",4076,null,null,{"$f":"LEFT(Q5,5)","v":"1"},1,0.02,2250,4500,null,"Medium",2,1,1,"No",22]
[null,null,null,null,null,null,null,null,null,{"$f":"IF(C5=\"single\",VLOOKUP(#REF!,'Premium Breakdown'!$A$3:$B$48,2,FALSE),IF(C5=\"Family of 4\",VLOOKUP(#REF!,'Premium Breakdown'!$A$3:$C$48,3,FALSE),\" \"))","v":" "},null,null,null,null,null,{"$f":"LEFT(Q6,5)","v":"1.01"},1.01,0.02,2250,4500,null,"High",3,2,2,null,23]
[null,"Please Tell Us About All The Adults That Would Be On The Plan","Identifier","Age","Uses Tobacco?",null,null,null,null,null,null,null,null,null,null,"1.02",1.02,0.02,2250,4500,null,null,4,"3 or More",3,null,24]
[null,null,{"$f":"IF(C5=\"\",\"\",IF(C5>0,\"Adult #1\",\"\"))","v":""},null,null,null,null,null,null,"Rounded Poverty Level",null,"Number of people on Plan",{"$f":"IF(D5=\"3 or More\",C5+3,C5+D5)","v":0},null,null,"1.03",1.03,0.02,2250,4500,null,null,5,null,null,null,25]
[null,null,{"$f":"IF(C5=\"\",\"\",IF(C5>1,\"Adult #2\",\"\"))","v":""},null,null,null,null,null,null,{"$f":"ROUND(C19/0.01,0)*0.01","v":{"$error":"#VALUE!"}},null,"New Base Poverty Level",{"$f":"M4+(M8-1)*M5","v":7575},null,null,"1.04",1.04,0.02,2250,4500,null,null,null,null,null,null,26]
[null,null,{"$f":"IF(C5=\"\",\"\",IF(C5>2,\"Adult #3\",\"\"))","v":""},null,null,null,null,null,null,null,null,null,null,null,null,"1.05",1.05,0.02,2250,4500,null,null,null,null,null,null,27]
[null,null,{"$f":"IF(C5=\"\",\"\",IF(C5>3,\"Adult #4\",\"\"))","v":""},null,null,null,null,null,null,null,null,null,null,null,null,"1.06",1.06,0.02,2250,4500,null,null,null,null,null,null,28]
[null,null,{"$f":"IF(C5=\"\",\"\",IF(C5>4,\"Adult #5\",\"\"))","v":""},null,null,null,null,{"$f":"LEFT(J9,5)","v":{"$error":"#VALUE!"}},null,null,null,null,null,null,null,"1.07",1.07,0.02,2250,4500,null,null,null,null,null,null,29]
[null,null,null,null,null,null,null,null,null,null,null,null,null,null,null,"1.08",1.08,0.02,2250,4500,null,null,null,null,null,null,30]
[null,"How Many Children Use Tobacco?",null,null,null,null,null,null,null,null,null,null,null,null,null,"1.09",1.0900000000000001,0.02,2250,4500,null,null,null,null,null,null,31]
[null,null,null,null,null,null,null,null,null,null,null,null,null,null,null,"1.1",1.1000000000000001,0.02,2250,4500,null,null,null,null,null,null,32]
[null,"Be Sure All Information Above Is Listed Correctly Before Pressing Complete.  Also Be Sure Adult Age/Tobacco Use Is Entered For All Adults.",null,null,null,null,null,null,null,null,null,null,null,null,null,"1.11",1.1100000000000001,0.02,2250,4500,null,null,null,null,null,null,33]
[null,null,null,null,null,null,null,null,null,null,null,null,null,null,null,"1.12",1.1200000000000001,0.02,2250,4500,null,null,null,null,null,null,34]
[null,"Personal Report",null,null,null,null,null,null,null,null,null,null,null,null,null,"1.13",1.1299999999999999,0.02,2250,4500,null,null,null,null,null,null,35]
[null,"% of Poverty Level",{"$f":"IF(OR(B5=\"\",C5=\"\",D5=\"\",E5=\"\"),\"\",B5/M9)","v":""},null,null,null,null,null,null,null,null,null,null,null,null,"1.14",1.1399999999999999,0.02,2250,4500,null,null,null,null,null,null,36]
[null,"Estimated Base Premium",{"$f":"IF(OR(B5=\"\",C5=\"\",D5=\"\",E5=\"\"),\"\",IF(C19<1,\"Medicaid Eligible\",IF(ISNA('Premium Breakdown'!K15),\"\",'Premium Breakdown'!K15)))","v":""},null,null,null,null,null,null,null,null,null,null,null,null,"1.15",1.1499999999999999,0.02,2250,4500,null,null,null,null,null,null,37]
[null,"Estimated Tobacco Surcharge",{"$f":"IF(OR(B5=\"\",C5=\"\",D5=\"\",E5=\"\"),\"\",IF(C19<1,\"Medicaid Eligible\",IF(ISNA('Premium Breakdown'!K16),\"\",'Premium Breakdown'!K16)))","v":""},null,null,null,null,null,null,null,null,null,null,null,null,"1.16",1.1599999999999999,0.02,2250,4500,null,null,null,null,null,null,38]
[null,"TOTAL Estimated Premium",{"$f":"IF(OR(B5=\"\",C5=\"\",D5=\"\",E5=\"\"),\"\",IF(C19<1,\"Medicaid Eligible\",C20+C21))","v":""},null,null,null,null,null,null,null,null,null,null,null,null,"1.17",1.17,0.02,2250,4500,null,null,null,null,null,null,39]
[null,"Percent of Income Owed for Premium",{"$f":"IF(OR(B5=\"\",C5=\"\",D5=\"\",E5=\"\"),\"\",IF(C19<1,\"Medicaid Eligible\",IF(C19>4,\"None\",IF(ISNA('Premium Breakdown'!K19),\"\",'Premium Breakdown'!K19))))","v":""},null,null,null,null,null,null,null,null,null,null,null,null,"1.18",1.18,0.02,2250,4500,null,null,null,null,null,null,40]
[null,"Estimated OOP Max Per Household",{"$f":"IF(OR(B5=\"\",C5=\"\",D5=\"\",E5=\"\"),\"\",IF(C19<1,\"Medicaid Eligible\",IF(M8>1,VLOOKUP(H12,$P$5:$T$4219,5,FALSE),VLOOKUP(H12,$P$5:$T$4219,4,FALSE))))","v":""},null,null,null,null,null,null,null,null,null,null,null,null,"1.19",1.19,0.02,2250,4500,null,null,null,null,null,null,41]
[null,"Government Tax Credit",{"$f":"IF(OR(B5=\"\",C5=\"\",D5=\"\",E5=\"\"),\"\",IF(ISNA('Premium Breakdown'!K21),\"\",'Premium Breakdown'!K21))","v":""},"Expected Estimated Monthly Rate After Subsidies",null,null,null,null,null,null,null,null,null,null,null,"1.2",1.2,0.02,2250,4500,null,null,null,null,null,null,42]
[null,"Amount Paid by Family/Person for Premium",{"$f":"IF(OR(B5=\"\",C5=\"\",D5=\"\",E5=\"\"),\"\",IF(ISNA('Premium Breakdown'!K22),\"\",'Premium Breakdown'!K22))","v":""},{"$f":"C26/12","v":{"$error":"#VALUE!"}},null,null,null,null,null,null,null,null,null,null,null,"1.21",1.21,0.02,2250,4500,null,null,null,null,null,null,43]
[null,null,null,null,null,null,null,null,null,null,null,null,null,null,null,"1.22",1.22,0.02,2250,4500,null,null,null,null,null,null,44]
[null,{"$f":"IF(OR(B5=\"\",C5=\"\",D5=\"\",E5=\"\"),\"\",IF(E5=\"Yes\",\"Important Notice:  Subsidies are only available for those who do not have other coverage available through an employer or employer coverage is unaffordable (over 9.5% of income)/valued at under 60% Actuarial Value.\",\"This calculator is simply an estimation based on data collected from the Congressional Budget Office and is meerly used to illustrate the differences in cost share amongst differently situated individuals.\"))","v":""},null,null,null,null,null,null,null,null,null,null,null,null,null,"1.23",1.23,0.02,2250,4500,null,null,null,null,null,null,45]
[null,null,null,null,null,null,null,null,null,null,null,null,null,null,null,"1.24",1.24,0.02,2250,4500,null,null,null,null,null,null,46]
[null,null,null,null,null,null,null,null,null,null,null,null,null,null,null,"1.25",1.25,0.02,2250,4500,null,null,null,null,null,null,47]
[null,null,null,null,null,null,null,null,null,null,null,null,null,null,null,"1.26",1.26,0.02,2250,4500,null,null,null,null,null,null,48]
[null,null,null,null,null,null,null,null,null,null,null,null,null,null,null,"1.27",1.27,0.02,2250,4500,null,null,null,null,null,null,49]
[null,null,null,null,null,null,null,null,null,null,null,null,null,null,null,"1.28",1.28,0.02,2250,4500,null,null,null,null,null,null,50]
[null,null,null,null,null,null,null,null,null,null,null,null,null,null,null,"1.29",1.29,0.02,2250,4500,null,null,null,null,null,null,51]
[null,null,null,null,null,null,null,null,null,null,null,null,null,null,null,"1.3",1.3,0.02,2250,4500,null,null,null,null,null,null,52]
[null,null,null,null,null,null,null,null,null,null,null,null,null,null,null,"1.31",1.31,0.02,2250,4500,null,null,null,null,null,null,53]
[null,null,null,null,null,null,null,null,null,null,null,null,null,null,null,"1.32",1.32,0.02,2250,4500,null,null,null,null,null,null,54]
[null,null,null,null,null,null,null,null,null,null,null,null,null,null,null,"1.33",1.33,0.03,2250,4500,null,null,null,null,null,null,55]
[null,null,null,null,null,null,null,null,null,null,null,null,null,null,null,"1.34",1.34,3.0599999999999999E-2,2250,4500,null,null,null,null,null,null,56]
[null,null,null,null,null,null,null,null,null,null,null,null,null,null,null,"1.35",1.35,3.1199999999999999E-2,2250,4500,null,null,null,null,null,null,57]
[null,null,null,null,null,null,null,null,null,null,null,null,null,null,null,"1.36",1.36,3.1779999999999996E-2,2250,4500,null,null,null,null,null,null,58]
[null,null,null,null,null,null,null,null,null,null,null,null,null,null,null,"1.37",1.37,3.2359999999999993E-2,2250,4500,null,null,null,null,null,null,59]
[null,null,null,null,null,null,null,null,null,null,null,null,null,null,null,"1.38",1.38,3.293999999999999E-2,2250,4500,null,null,null,null,null,null,60]
[null,null,null,null,null,null,null,null,null,null,null,null,null,null,null,"1.39",1.39,3.3664999999999987E-2,2250,4500,null,null,null,null,null,null,61]
[null,null,null,null,null,null,null,null,null,null,null,null,null,null,null,"1.4",1.4,3.4099999999999998E-2,2250,4500,null,null,null,null,null,null,62]
[null,null,null,null,null,null,null,null,null,null,null,null,null,null,null,"1.41",1.41,3.4700000000000002E-2,2250,4500,null,null,null,null,null,null,63]
[null,null,null,null,null,null,null,null,null,null,null,null,null,null,null,"1.42",1.42,3.5300000000000005E-2,2250,4500,null,null,null,null,null,null,64]
[null,null,null,null,null,null,null,null,null,null,null,null,null,null,null,"1.43",1.43,3.5900000000000008E-2,2250,4500]
[null,null,null,null,null,null,null,null,null,null,null,null,null,null,null,"1.44",1.44,3.6650000000000009E-2,2250,4500]
[null,null,null,null,null,null,null,null,null,null,null,null,null,null,null,"1.45",1.45,3.7100000000000001E-2,2250,4500]
[null,null,null,null,null,null,null,null,null,null,null,null,null,null,null,"1.46",1.46,3.7679999999999998E-2,2250,4500]
[null,null,null,null,null,null,null,null,null,null,null,null,null,null,null,"1.47",1.47,3.8259999999999995E-2,2250,4500]
[null,null,null,null,null,null,null,null,null,null,null,null,null,null,null,"1.48",1.48,3.8839999999999993E-2,2250,4500]
[null,null,null,null,null,null,null,null,null,null,null,null,null,null,null,"1.49",1.49,3.9564999999999989E-2,2250,4500]
[null,null,null,null,null,null,null,null,null,null,null,null,null,null,null,"1.5",1.5,0.04,2250,4500]
[null,null,null,null,null,null,null,null,null,null,null,null,null,null,null,"1.51",1.51,4.0460000000000003E-2,2250,4500]
[null,null,null,null,null,null,null,null,null,null,null,null,null,null,null,"1.52",1.52,4.0920000000000005E-2,2250,4500]
[null,null,null,null,null,null,null,null,null,null,null,null,null,null,null,"1.53",1.53,4.1380000000000007E-2,2250,4500]
[null,null,null,null,null,null,null,null,null,null,null,null,null,null,null,"1.54",1.54,4.1955000000000006E-2,2250,4500]
[null,null,null,null,null,null,null,null,null,null,null,null,null,null,null,"1.55",1.55,4.2299999999999997E-2,2250,4500]
[null,null,null,null,null,null,null,null,null,null,null,null,null,null,null,"1.56",1.56,4.2759999999999999E-2,2250,4500]
[null,null,null,null,null,null,null,null,null,null,null,null,null,null,null,"1.57",1.57,4.3220000000000001E-2,2250,4500]
[null,null,null,null,null,null,null,null,null,null,null,null,null,null,null,"1.58",1.58,4.3680000000000004E-2,2250,4500]
[null,null,null,null,null,null,null,null,null,null,null,null,null,null,null,"1.59",1.59,4.4255000000000003E-2,2250,4500]
[null,null,null,null,null,null,null,null,null,null,null,null,null,null,null,"1.6",1.6,4.4600000000000001E-2,2250,4500]
[null,null,null,null,null,null,null,null,null,null,null,null,null,null,null,"1.61",1.61,4.5060000000000003E-2,2250,4500]
[null,null,null,null,null,null,null,null,null,null,null,null,null,null,null,"1.62",1.62,4.5520000000000005E-2,2250,4500]
[null,null,null,null,null,null,null,null,null,null,null,null,null,null,null,"1.63",1.63,4.5980000000000007E-2,2250,4500]
[null,null,null,null,null,null,null,null,null,null,null,null,null,null,null,"1.64",1.64,4.6555000000000006E-2,2250,4500]
[null,null,null,null,null,null,null,null,null,null,null,null,null,null,null,{"$f":"LEFT(Q70,5)","v":"1.65"},1.65,4.6899999999999997E-2,2250,4500]
[null,null,null,null,null,null,null,null,null,null,null,null,null,null,null,"1.66",1.66,4.7359999999999999E-2,2250,4500]
[null,null,null,null,null,null,null,null,null,null,null,null,null,null,null,"1.67",1.67,4.7820000000000001E-2,2250,4500]
[null,null,null,null,null,null,null,null,null,null,null,null,null,null,null,"1.68",1.68,4.8280000000000003E-2,2250,4500]
[null,null,null,null,null,null,null,null,null,null,null,null,null,null,null,"1.69",1.69,4.8855000000000003E-2,2250,4500]
[null,null,null,null,null,null,null,null,null,null,null,null,null,null,null,"1.7",1.7,4.9200000000000001E-2,2250,4500]
[null,null,null,null,null,null,null,null,null,null,null,null,null,null,null,"1.71",1.71,4.9660000000000003E-2,2250,4500]
[null,null,null,null,null,null,null,null,null,null,null,null,null,null,null,"1.72",1.72,5.0120000000000005E-2,2250,4500]
[null,null,null,null,null,null,null,null,null,null,null,null,null,null,null,"1.73",1.73,5.0580000000000007E-2,2250,4500]
[null,null,null,null,null,null,null,null,null,null,null,null,null,null,null,"1.74",1.74,5.1155000000000006E-2,2250,4500]
[null,null,null,null,null,null,null,null,null,null,null,null,null,null,null,"1.75",1.75,5.1499999999999997E-2,2250,4500]
[null,null,null,null,null,null,null,null,null,null,null,null,null,null,null,"1.76",1.76,5.1959999999999999E-2,2250,4500]
[null,null,null,null,null,null,null,null,null,null,null,null,null,null,null,"1.77",1.77,5.2420000000000001E-2,2250,4500]
[null,null,null,null,null,null,null,null,null,null,null,null,null,null,null,"1.78",1.78,5.2880000000000003E-2,2250,4500]
[null,null,null,null,null,null,null,null,null,null,null,null,null,null,null,"1.79",1.79,5.3455000000000003E-2,2250,4500]
[null,null,null,null,null,null,null,null,null,null,null,null,null,null,null,"1.8",1.8,5.3800000000000001E-2,2250,4500]
[null,null,null,null,null,null,null,null,null,null,null,null,null,null,null,"1.81",1.81,5.4260000000000003E-2,2250,4500]
[null,null,null,null,null,null,null,null,null,null,null,null,null,null,null,"1.82",1.82,5.4720000000000005E-2,2250,4500]
[null,null,null,null,null,null,null,null,null,null,null,null,null,null,null,"1.83",1.83,5.5180000000000007E-2,2250,4500]
[null,null,null,null,null,null,null,null,null,null,null,null,null,null,null,"1.84",1.84,5.5755000000000006E-2,2250,4500]
[null,null,null,null,null,null,null,null,null,null,null,null,null,null,null,"1.85",1.85,5.6099999999999997E-2,2250,4500]
[null,null,null,null,null,null,null,null,null,null,null,null,null,null,null,"1.86",1.86,5.6559999999999999E-2,2250,4500]
[null,null,null,null,null,null,null,null,null,null,null,null,null,null,null,"1.87",1.87,5.7020000000000001E-2,2250,4500]
[null,null,null,null,null,null,null,null,null,null,null,null,null,null,null,"1.88",1.88,5.7480000000000003E-2,2250,4500]
[null,null,null,null,null,null,null,null,null,null,null,null,null,null,null,"1.89",1.89,5.8055000000000002E-2,2250,4500]
[null,null,null,null,null,null,null,null,null,null,null,null,null,null,null,"1.9",1.9,5.8400000000000001E-2,2250,4500]
[null,null,null,null,null,null,null,null,null,null,null,null,null,null,null,"1.91",1.91,5.8860000000000003E-2,2250,4500]
[null,null,null,null,null,null,null,null,null,null,null,null,null,null,null,"1.92",1.92,5.9320000000000005E-2,2250,4500]
[null,null,null,null,null,null,null,null,null,null,null,null,null,null,null,"1.93",1.93,5.9780000000000007E-2,2250,4500]
[null,null,null,null,null,null,null,null,null,null,null,null,null,null,null,"1.94",1.94,6.0355000000000006E-2,2250,4500]
[null,null,null,null,null,null,null,null,null,null,null,null,null,null,null,"1.95",1.95,6.0699999999999997E-2,2250,4500]
[null,null,null,null,null,null,null,null,null,null,null,null,null,null,null,"1.96",1.96,6.1159999999999999E-2,2250,4500]
[null,null,null,null,null,null,null,null,null,null,null,null,null,null,null,"1.97",1.97,6.1620000000000001E-2,2250,4500]
[null,null,null,null,null,null,null,null,null,null,null,null,null,null,null,"1.98",1.98,6.2080000000000003E-2,2250,4500]
[null,null,null,null,null,null,null,null,null,null,null,null,null,null,null,"1.99",1.99,6.2655000000000002E-2,2250,4500]
[null,null,null,null,null,null,null,null,null,null,null,null,null,null,null,"2",2,6.3E-2,5200,10400]
[null,null,null,null,null,null,null,null,null,null,null,null,null,null,null,"2.01",2.0099999999999998,6.3339999999999994E-2,5200,10400]
[null,null,null,null,null,null,null,null,null,null,null,null,null,null,null,"2.02",2.02,6.3679999999999987E-2,5200,10400]
[null,null,null,null,null,null,null,null,null,null,null,null,null,null,null,"2.03",2.0299999999999998,6.401999999999998E-2,5200,10400]
[null,null,null,null,null,null,null,null,null,null,null,null,null,null,null,"2.04",2.04,6.4444999999999975E-2,5200,10400]
[null,null,null,null,null,null,null,null,null,null,null,null,null,null,null,"2.05",2.0499999999999998,6.4699999999999994E-2,5200,10400]
[null,null,null,null,null,null,null,null,null,null,null,null,null,null,null,"2.06",2.06,6.5059999999999993E-2,5200,10400]
[null,null,null,null,null,null,null,null,null,null,null,null,null,null,null,"2.07",2.0699999999999998,6.5419999999999992E-2,5200,10400]
[null,null,null,null,null,null,null,null,null,null,null,null,null,null,null,"2.08",2.08,6.5779999999999991E-2,5200,10400]
[null,null,null,null,null,null,null,null,null,null,null,null,null,null,null,"2.09",2.09,6.6229999999999997E-2,5200,10400]
[null,null,null,null,null,null,null,null,null,null,null,null,null,null,null,"2.1",2.1,6.6500000000000004E-2,5200,10400]
[null,null,null,null,null,null,null,null,null,null,null,null,null,null,null,"2.11",2.11,6.6860000000000003E-2,5200,10400]
[null,null,null,null,null,null,null,null,null,null,null,null,null,null,null,"2.12",2.12,6.7220000000000002E-2,5200,10400]
[null,null,null,null,null,null,null,null,null,null,null,null,null,null,null,"2.13",2.13,6.7580000000000001E-2,5200,10400]
[null,null,null,null,null,null,null,null,null,null,null,null,null,null,null,"2.14",2.14,6.8030000000000007E-2,5200,10400]
[null,null,null,null,null,null,null,null,null,null,null,null,null,null,null,"2.15",2.15,6.83E-2,5200,10400]
{"$rows_left_out":4100}
{"sheet":"Premium Breakdown","index":1,"n_rows":48,"n_cols":12,"rows_kept":48,"cut":false,"hidden":true,"merged":[[0,0,0,5]]}
["Premium by Age (2014)"]
["Age","Each Adult (21 +)","Tobacco Penalty",null,"Each Child Worth","Child Tobacco Penalty",null,null,null,null,"Premium","Tobacco Pen"]
[null,null,null,null,1917,{"$f":"E3*0.5","v":958.5},null,null,null,"Adult #1",{"$f":"IF(InputSheet!D8=\"\",0,VLOOKUP(InputSheet!D8,'Premium Breakdown'!$A$5:$B$48,2,FALSE))","v":0},{"$f":"IF(InputSheet!E8=\"YES\",VLOOKUP(InputSheet!D8,'Premium Breakdown'!$A$5:$C$48,3,FALSE),0)","v":0}]
[null,null,null,null,null,null,null,null,null,"Adult #2",{"$f":"IF(InputSheet!D9=\"\",0,VLOOKUP(InputSheet!D9,'Premium Breakdown'!$A$5:$B$48,2,FALSE))","v":0},{"$f":"IF(InputSheet!E9=\"YES\",VLOOKUP(InputSheet!D9,'Premium Breakdown'!$A$5:$C$48,3,FALSE),0)","v":0}]
[21,3018,{"$f":"B5*0.5","v":1509},null,null,null,null,null,null,"Adult #3",{"$f":"IF(InputSheet!D10=\"\",0,VLOOKUP(InputSheet!D10,'Premium Breakdown'!$A$5:$B$48,2,FALSE))","v":0},{"$f":"IF(InputSheet!E10=\"YES\",VLOOKUP(InputSheet!D10,'Premium Breakdown'!$A$5:$C$48,3,FALSE),0)","v":0}]
[22,3018,{"$f":"B6*0.5","v":1509},null,null,null,null,null,null,"Adult #4",{"$f":"IF(InputSheet!D11=\"\",0,VLOOKUP(InputSheet!D11,'Premium Breakdown'!$A$5:$B$48,2,FALSE))","v":0},{"$f":"IF(InputSheet!E11=\"YES\",VLOOKUP(InputSheet!D11,'Premium Breakdown'!$A$5:$C$48,3,FALSE),0)","v":0}]
[23,3018,1509,null,null,null,null,null,null,"Adult #5",{"$f":"IF(InputSheet!D12=\"\",0,VLOOKUP(InputSheet!D12,'Premium Breakdown'!$A$5:$B$48,2,FALSE))","v":0},{"$f":"IF(InputSheet!E12=\"YES\",VLOOKUP(InputSheet!D12,'Premium Breakdown'!$A$5:$C$48,3,FALSE),0)","v":0}]
[24,3018,1509]
[25,3030,1515,null,null,null,null,null,null,"Adult Premium",{"$f":"SUM(K3:K7)","v":0}]
[26,3091,1545.5,null,null,null,null,null,null,"Child Premium",{"$f":"IF(InputSheet!D5=\"3 Or More\",E3*3,E3*InputSheet!D5)","v":0}]
[27,3163,1581.5]
[28,3281,1640.5,null,null,null,null,null,null,"Total Child Tobacco Pen.",{"$f":"IF(InputSheet!D5=0,0,F3*InputSheet!C14)","v":0}]
[29,3377,1688.5,null,null,null,null,null,null,"Total Adult Tobacco Pen.",{"$f":"SUM(L3:L7)","v":0}]
[30,3426,1713]
[31,3498,1749,null,null,null,null,null,null,"Total Estimated Premium",{"$f":"K9+K10","v":0}]
[32,3570,1785,null,null,null,null,null,null,"Total Tobacco Penalty",{"$f":"SUM(K12:K13)","v":0}]
[33,3616,1808]
[34,3664,1832]
[35,3688,1844,null,null,null,null,null,null,"Total Subsidy %",{"$f":"VLOOKUP(InputSheet!H12,InputSheet!$P$5:$R$4219,3,FALSE)","v":{"$error":"#VALUE!"}}]
[36,3712,1856,null,null,null,null,null,null,"Total Dollars EE pays (b4 tobacco)",{"$f":"IF(K19*InputSheet!B5>=K15,K15,K19*InputSheet!B5)","v":{"$error":"#VALUE!"}}]
[37,3736,1868,null,null,null,null,null,null,"Total Gov. Susidy",{"$f":"IF(InputSheet!C19<1,\"Medicaid Eligible\",IF(InputSheet!C19>4,\"Income to High for Subsidies\",IF(K20>=K15,0,K15-K20)))","v":"Income to High for Subsidies"}]
[38,3761,1880.5,null,null,null,null,null,null,"Dollars EE pays Out (final bill)",{"$f":"IF(InputSheet!C19<1,\"Medicaid Eligible\",IF(K19*InputSheet!B5>=(K15+K16),(K15+K16),K20+K16))","v":{"$error":"#VALUE!"}}]
[39,3809,1904.5]
[40,3857,1928.5]
[41,3930,1965]
[42,3999,1999.5]
[43,4096,2048]
[44,4216,2108]
[45,4358,2179]
[46,4527,2263.5]
[47,4717,2358.5]
[48,4935,2467.5]
[49,5149,2574.5]
[50,5390,2695]
[51,5629,2814.5]
[52,5891,2945.5]
[53,6157,3078.5]
[54,6444,3222]
[55,6730,3365]
[56,7041,3520.5]
[57,7355,3677.5]
[58,7690,3845]
[59,7856,3928]
[60,8191,4095.5]
[61,8481,4240.5]
[62,8671,4335.5,null,null,null,60]
[63,8909,4454.5]
[64,9054,4527]